Travis - SmokeTest.test_fairshare sometimes fails on ubuntu

Description

SmokeTest.test_fairshare sometimes fails in Travis.
This issue was observed during PR https://github.com/PBSPro/pbspro/pull/867 which had multiple commits, and the test failed once with this issue. The failure does not relate to the changes in the PR.

Below are the test logs:

2018-12-07 09:11:49,204 INFOCLI testdev: /opt/pbs/bin/qstat -f 28.testdev
2018-12-07 09:11:49,218 INFO expect on server testdev: job_state = Q job 28.testdev ... OK
2018-12-07 09:11:49,218 INFO manager on testdev: set server {'scheduling': 'True'}
2018-12-07 09:11:49,219 INFOCLI testdev: /opt/pbs/bin/qmgr -c set server scheduling=True
2018-12-07 09:11:49,231 INFOCLI testdev: /opt/pbs/bin/qstat -Bf testdev.pbspro.org
2018-12-07 09:11:49,241 INFO expect on server testdev: server_state != Scheduling server testdev.pbspro.org got: server_state = Scheduling
2018-12-07 09:11:49,742 INFOCLI testdev: /opt/pbs/bin/qstat -Bf testdev.pbspro.org
2018-12-07 09:11:49,753 INFO expect on server testdev: server_state != Scheduling server testdev.pbspro.org attempt: 2 got: server_state = Scheduling
2018-12-07 09:11:50,254 INFOCLI testdev: /opt/pbs/bin/qstat -Bf testdev.pbspro.org
2018-12-07 09:11:50,266 INFO expect on server testdev: server_state != Scheduling server testdev.pbspro.org attempt: 3 got: server_state = Scheduling
2018-12-07 09:11:50,767 INFOCLI testdev: /opt/pbs/bin/qstat -Bf testdev.pbspro.org
2018-12-07 09:11:50,781 INFO expect on server testdev: server_state != Scheduling server testdev.pbspro.org attempt: 4 got: server_state = Scheduling
2018-12-07 09:11:51,282 INFOCLI testdev: /opt/pbs/bin/qstat -Bf testdev.pbspro.org
2018-12-07 09:11:51,293 INFO expect on server testdev: server_state != Scheduling server testdev.pbspro.org attempt: 5 got: server_state = Scheduling
2018-12-07 09:11:51,794 INFOCLI testdev: /opt/pbs/bin/qstat -Bf testdev.pbspro.org
2018-12-07 09:11:51,806 INFO expect on server testdev: server_state != Scheduling server testdev.pbspro.org attempt: 6 got: server_state = Scheduling
2018-12-07 09:11:52,307 INFOCLI testdev: /opt/pbs/bin/qstat -Bf testdev.pbspro.org
2018-12-07 09:11:52,322 INFO expect on server testdev: server_state != Scheduling server testdev.pbspro.org attempt: 7 got: server_state = Scheduling
2018-12-07 09:11:52,823 INFOCLI testdev: /opt/pbs/bin/qstat -Bf testdev.pbspro.org
2018-12-07 09:11:52,833 INFO expect on server testdev: server_state != Scheduling server testdev.pbspro.org attempt: 8 got: server_state = Scheduling
2018-12-07 09:11:53,334 INFOCLI testdev: /opt/pbs/bin/qstat -Bf testdev.pbspro.org
2018-12-07 09:11:53,345 INFO expect on server testdev: server_state != Scheduling server testdev.pbspro.org attempt: 9 got: server_state = Scheduling
2018-12-07 09:11:53,846 INFOCLI testdev: /opt/pbs/bin/qstat -Bf testdev.pbspro.org
2018-12-07 09:11:53,855 INFO expect on server testdev: server_state != Scheduling server testdev.pbspro.org attempt: 10 got: server_state = Scheduling
2018-12-07 09:11:54,356 INFOCLI testdev: /opt/pbs/bin/qstat -Bf testdev.pbspro.org
2018-12-07 09:11:54,367 INFO expect on server testdev: server_state != Scheduling server testdev.pbspro.org attempt: 11 got: server_state = Scheduling
2018-12-07 09:11:54,868 INFOCLI testdev: /opt/pbs/bin/qstat -Bf testdev.pbspro.org
2018-12-07 09:11:54,878 INFO expect on server testdev: server_state != Scheduling server testdev.pbspro.org attempt: 12 got: server_state = Scheduling
2018-12-07 09:11:55,379 INFOCLI testdev: /opt/pbs/bin/qstat -Bf testdev.pbspro.org
2018-12-07 09:11:55,390 INFO expect on server testdev: server_state != Scheduling server testdev.pbspro.org attempt: 13 got: server_state = Scheduling
2018-12-07 09:11:55,891 INFOCLI testdev: /opt/pbs/bin/qstat -Bf testdev.pbspro.org
2018-12-07 09:11:55,902 INFO expect on server testdev: server_state != Scheduling server testdev.pbspro.org attempt: 14 got: server_state = Scheduling
2018-12-07 09:11:56,403 INFOCLI testdev: /opt/pbs/bin/qstat -Bf testdev.pbspro.org
2018-12-07 09:11:56,413 INFO expect on server testdev: server_state != Scheduling server testdev.pbspro.org attempt: 15 got: server_state = Scheduling
2018-12-07 09:11:56,914 INFOCLI testdev: /opt/pbs/bin/qstat -Bf testdev.pbspro.org
2018-12-07 09:11:56,924 INFO expect on server testdev: server_state != Scheduling server testdev.pbspro.org attempt: 16 got: server_state = Scheduling
2018-12-07 09:11:57,425 INFOCLI testdev: /opt/pbs/bin/qstat -Bf testdev.pbspro.org
2018-12-07 09:11:57,435 INFO expect on server testdev: server_state != Scheduling server testdev.pbspro.org attempt: 17 got: server_state = Scheduling
2018-12-07 09:11:57,936 INFOCLI testdev: /opt/pbs/bin/qstat -Bf testdev.pbspro.org
2018-12-07 09:11:57,947 INFO expect on server testdev: server_state != Scheduling server testdev.pbspro.org attempt: 18 got: server_state = Scheduling
2018-12-07 09:11:58,448 INFOCLI testdev: /opt/pbs/bin/qstat -Bf testdev.pbspro.org
2018-12-07 09:11:58,459 INFO expect on server testdev: server_state != Scheduling server testdev.pbspro.org attempt: 19 got: server_state = Scheduling
2018-12-07 09:11:58,960 INFOCLI testdev: /opt/pbs/bin/qstat -Bf testdev.pbspro.org
2018-12-07 09:11:58,970 INFO expect on server testdev: server_state != Scheduling server testdev.pbspro.org attempt: 20 got: server_state = Scheduling
2018-12-07 09:11:59,471 INFOCLI testdev: /opt/pbs/bin/qstat -Bf testdev.pbspro.org
2018-12-07 09:11:59,482 INFO expect on server testdev: server_state != Scheduling server testdev.pbspro.org attempt: 21 got: server_state = Scheduling
2018-12-07 09:11:59,983 INFOCLI testdev: /opt/pbs/bin/qstat -Bf testdev.pbspro.org
2018-12-07 09:11:59,993 INFO expect on server testdev: server_state != Scheduling server testdev.pbspro.org attempt: 22 got: server_state = Scheduling
2018-12-07 09:12:00,494 INFOCLI testdev: /opt/pbs/bin/qstat -Bf testdev.pbspro.org
2018-12-07 09:12:00,508 INFO expect on server testdev: server_state != Scheduling server testdev.pbspro.org attempt: 23 got: server_state = Scheduling
2018-12-07 09:12:01,009 INFOCLI testdev: /opt/pbs/bin/qstat -Bf testdev.pbspro.org
2018-12-07 09:12:01,020 INFO expect on server testdev: server_state != Scheduling server testdev.pbspro.org attempt: 24 got: server_state = Scheduling
2018-12-07 09:12:01,521 INFOCLI testdev: /opt/pbs/bin/qstat -Bf testdev.pbspro.org
2018-12-07 09:12:01,532 INFO expect on server testdev: server_state != Scheduling server testdev.pbspro.org attempt: 25 got: server_state = Scheduling
2018-12-07 09:12:02,033 INFOCLI testdev: /opt/pbs/bin/qstat -Bf testdev.pbspro.org
2018-12-07 09:12:02,043 INFO expect on server testdev: server_state != Scheduling server testdev.pbspro.org attempt: 26 got: server_state = Scheduling
2018-12-07 09:12:02,544 INFOCLI testdev: /opt/pbs/bin/qstat -Bf testdev.pbspro.org
2018-12-07 09:12:02,554 INFO expect on server testdev: server_state != Scheduling server testdev.pbspro.org attempt: 27 got: server_state = Scheduling
2018-12-07 09:12:03,055 INFOCLI testdev: /opt/pbs/bin/qstat -Bf testdev.pbspro.org
2018-12-07 09:12:03,065 INFO expect on server testdev: server_state != Scheduling server testdev.pbspro.org attempt: 28 got: server_state = Scheduling
2018-12-07 09:12:03,565 INFOCLI testdev: /opt/pbs/bin/qstat -Bf testdev.pbspro.org
2018-12-07 09:12:03,575 INFO expect on server testdev: server_state != Scheduling server testdev.pbspro.org attempt: 29 got: server_state = Scheduling
2018-12-07 09:12:04,076 INFOCLI testdev: /opt/pbs/bin/qstat -Bf testdev.pbspro.org
2018-12-07 09:12:04,085 INFO expect on server testdev: server_state != Scheduling server testdev.pbspro.org attempt: 30 got: server_state = Scheduling
2018-12-07 09:12:04,586 INFOCLI testdev: /opt/pbs/bin/qstat -Bf testdev.pbspro.org
2018-12-07 09:12:04,596 INFO expect on server testdev: server_state != Scheduling server testdev.pbspro.org attempt: 31 got: server_state = Scheduling
2018-12-07 09:12:05,097 INFOCLI testdev: /opt/pbs/bin/qstat -Bf testdev.pbspro.org
2018-12-07 09:12:05,108 INFO expect on server testdev: server_state != Scheduling server testdev.pbspro.org attempt: 32 got: server_state = Scheduling
2018-12-07 09:12:05,609 INFOCLI testdev: /opt/pbs/bin/qstat -Bf testdev.pbspro.org
2018-12-07 09:12:05,620 INFO expect on server testdev: server_state != Scheduling server testdev.pbspro.org attempt: 33 got: server_state = Scheduling
2018-12-07 09:12:06,122 INFOCLI testdev: /opt/pbs/bin/qstat -Bf testdev.pbspro.org
2018-12-07 09:12:06,132 INFO expect on server testdev: server_state != Scheduling server testdev.pbspro.org attempt: 34 got: server_state = Scheduling
2018-12-07 09:12:06,633 INFOCLI testdev: /opt/pbs/bin/qstat -Bf testdev.pbspro.org
2018-12-07 09:12:06,642 INFO expect on server testdev: server_state != Scheduling server testdev.pbspro.org attempt: 35 got: server_state = Scheduling
2018-12-07 09:12:07,143 INFOCLI testdev: /opt/pbs/bin/qstat -Bf testdev.pbspro.org
2018-12-07 09:12:07,154 INFO expect on server testdev: server_state != Scheduling server testdev.pbspro.org attempt: 36 got: server_state = Scheduling
2018-12-07 09:12:07,655 INFOCLI testdev: /opt/pbs/bin/qstat -Bf testdev.pbspro.org
2018-12-07 09:12:07,665 INFO expect on server testdev: server_state != Scheduling server testdev.pbspro.org attempt: 37 got: server_state = Scheduling
2018-12-07 09:12:08,166 INFOCLI testdev: /opt/pbs/bin/qstat -Bf testdev.pbspro.org
2018-12-07 09:12:08,175 INFO expect on server testdev: server_state != Scheduling server testdev.pbspro.org attempt: 38 got: server_state = Scheduling
2018-12-07 09:12:08,676 INFOCLI testdev: /opt/pbs/bin/qstat -Bf testdev.pbspro.org
2018-12-07 09:12:08,686 INFO expect on server testdev: server_state != Scheduling server testdev.pbspro.org attempt: 39 got: server_state = Scheduling
2018-12-07 09:12:09,187 INFOCLI testdev: /opt/pbs/bin/qstat -Bf testdev.pbspro.org
2018-12-07 09:12:09,196 INFO expect on server testdev: server_state != Scheduling server testdev.pbspro.org attempt: 40 got: server_state = Scheduling
2018-12-07 09:12:09,697 INFOCLI testdev: /opt/pbs/bin/qstat -Bf testdev.pbspro.org
2018-12-07 09:12:09,707 INFO expect on server testdev: server_state != Scheduling server testdev.pbspro.org attempt: 41 got: server_state = Scheduling
2018-12-07 09:12:10,208 INFOCLI testdev: /opt/pbs/bin/qstat -Bf testdev.pbspro.org
2018-12-07 09:12:10,217 INFO expect on server testdev: server_state != Scheduling server testdev.pbspro.org attempt: 42 got: server_state = Scheduling
2018-12-07 09:12:10,718 INFOCLI testdev: /opt/pbs/bin/qstat -Bf testdev.pbspro.org
2018-12-07 09:12:10,728 INFO expect on server testdev: server_state != Scheduling server testdev.pbspro.org attempt: 43 got: server_state = Scheduling
2018-12-07 09:12:11,229 INFOCLI testdev: /opt/pbs/bin/qstat -Bf testdev.pbspro.org
2018-12-07 09:12:11,239 INFO expect on server testdev: server_state != Scheduling server testdev.pbspro.org attempt: 44 got: server_state = Scheduling
2018-12-07 09:12:11,740 INFOCLI testdev: /opt/pbs/bin/qstat -Bf testdev.pbspro.org
2018-12-07 09:12:11,750 INFO expect on server testdev: server_state != Scheduling server testdev.pbspro.org attempt: 45 got: server_state = Scheduling
2018-12-07 09:12:12,251 INFOCLI testdev: /opt/pbs/bin/qstat -Bf testdev.pbspro.org
2018-12-07 09:12:12,260 INFO expect on server testdev: server_state != Scheduling server testdev.pbspro.org attempt: 46 got: server_state = Scheduling
2018-12-07 09:12:12,761 INFOCLI testdev: /opt/pbs/bin/qstat -Bf testdev.pbspro.org
2018-12-07 09:12:12,773 INFO expect on server testdev: server_state != Scheduling server testdev.pbspro.org attempt: 47 got: server_state = Scheduling
2018-12-07 09:12:13,274 INFOCLI testdev: /opt/pbs/bin/qstat -Bf testdev.pbspro.org
2018-12-07 09:12:13,283 INFO expect on server testdev: server_state != Scheduling server testdev.pbspro.org attempt: 48 got: server_state = Scheduling
2018-12-07 09:12:13,784 INFOCLI testdev: /opt/pbs/bin/qstat -Bf testdev.pbspro.org
2018-12-07 09:12:13,794 INFO expect on server testdev: server_state != Scheduling server testdev.pbspro.org attempt: 49 got: server_state = Scheduling
2018-12-07 09:12:14,295 INFOCLI testdev: /opt/pbs/bin/qstat -Bf testdev.pbspro.org
2018-12-07 09:12:14,305 INFO expect on server testdev: server_state != Scheduling server testdev.pbspro.org attempt: 50 got: server_state = Scheduling
2018-12-07 09:12:14,806 INFOCLI testdev: /opt/pbs/bin/qstat -Bf testdev.pbspro.org
2018-12-07 09:12:14,819 INFO expect on server testdev: server_state != Scheduling server testdev.pbspro.org attempt: 51 got: server_state = Scheduling
2018-12-07 09:12:15,320 INFOCLI testdev: /opt/pbs/bin/qstat -Bf testdev.pbspro.org
2018-12-07 09:12:15,330 INFO expect on server testdev: server_state != Scheduling server testdev.pbspro.org attempt: 52 got: server_state = Scheduling
2018-12-07 09:12:15,831 INFOCLI testdev: /opt/pbs/bin/qstat -Bf testdev.pbspro.org
2018-12-07 09:12:15,842 INFO expect on server testdev: server_state != Scheduling server testdev.pbspro.org attempt: 53 got: server_state = Scheduling
2018-12-07 09:12:16,343 INFOCLI testdev: /opt/pbs/bin/qstat -Bf testdev.pbspro.org
2018-12-07 09:12:16,352 INFO expect on server testdev: server_state != Scheduling server testdev.pbspro.org attempt: 54 got: server_state = Scheduling
2018-12-07 09:12:16,854 INFOCLI testdev: /opt/pbs/bin/qstat -Bf testdev.pbspro.org
2018-12-07 09:12:16,863 INFO expect on server testdev: server_state != Scheduling server testdev.pbspro.org attempt: 55 got: server_state = Scheduling
2018-12-07 09:12:17,364 INFOCLI testdev: /opt/pbs/bin/qstat -Bf testdev.pbspro.org
2018-12-07 09:12:17,374 INFO expect on server testdev: server_state != Scheduling server testdev.pbspro.org attempt: 56 got: server_state = Scheduling
2018-12-07 09:12:17,875 INFOCLI testdev: /opt/pbs/bin/qstat -Bf testdev.pbspro.org
2018-12-07 09:12:17,886 INFO expect on server testdev: server_state != Scheduling server testdev.pbspro.org attempt: 57 got: server_state = Scheduling
2018-12-07 09:12:18,387 INFOCLI testdev: /opt/pbs/bin/qstat -Bf testdev.pbspro.org
2018-12-07 09:12:18,397 INFO expect on server testdev: server_state != Scheduling server testdev.pbspro.org attempt: 58 got: server_state = Scheduling
2018-12-07 09:12:18,898 INFOCLI testdev: /opt/pbs/bin/qstat -Bf testdev.pbspro.org
2018-12-07 09:12:18,909 INFO expect on server testdev: server_state != Scheduling server testdev.pbspro.org attempt: 59 got: server_state = Scheduling
2018-12-07 09:12:19,410 INFOCLI testdev: /opt/pbs/bin/qstat -Bf testdev.pbspro.org
2018-12-07 09:12:19,420 INFO expect on server testdev: server_state != Scheduling server testdev.pbspro.org attempt: 60 got: server_state = Scheduling
2018-12-07 09:12:19,926 INFO FAILED
...
2018-12-07 09:18:41,941 INFO
2018-12-07 09:18:41,942 INFO ======================================================================
2018-12-07 09:18:41,942 INFO FAILED: test_fairshare (tests.pbs_smoketest.SmokeTest)

2018-12-07 09:18:41,942 INFO __m_oo_m__
2018-12-07 09:18:41,942 INFO Traceback (most recent call last):
File "/usr/local/lib/python2.7/dist-packages/ptl/utils/pbs_testsuite.py", line 208, in wrapper
function(self, *args, **kwargs)
File "/home/travis/build/PBSPro/pbspro/test/tests/pbs_smoketest.py", line 439, in test_fairshare
self.server.expect(SERVER, a, op=NE)
File "/usr/local/lib/python2.7/dist-packages/ptl/lib/pbs_testlib.py", line 8296, in expect
extend, level=level, msg=" ".join(msg))
File "/usr/local/lib/python2.7/dist-packages/ptl/lib/pbs_testlib.py", line 8296, in expect
extend, level=level, msg=" ".join(msg))
File "/usr/local/lib/python2.7/dist-packages/ptl/lib/pbs_testlib.py", line 8296, in expect
extend, level=level, msg=" ".join(msg))
File "/usr/local/lib/python2.7/dist-packages/ptl/lib/pbs_testlib.py", line 8296, in expect
extend, level=level, msg=" ".join(msg))
File "/usr/local/lib/python2.7/dist-packages/ptl/lib/pbs_testlib.py", line 8296, in expect
extend, level=level, msg=" ".join(msg))
File "/usr/local/lib/python2.7/dist-packages/ptl/lib/pbs_testlib.py", line 8296, in expect
extend, level=level, msg=" ".join(msg))
File "/usr/local/lib/python2.7/dist-packages/ptl/lib/pbs_testlib.py", line 8296, in expect
extend, level=level, msg=" ".join(msg))
File "/usr/local/lib/python2.7/dist-packages/ptl/lib/pbs_testlib.py", line 8296, in expect
extend, level=level, msg=" ".join(msg))
File "/usr/local/lib/python2.7/dist-packages/ptl/lib/pbs_testlib.py", line 8296, in expect
extend, level=level, msg=" ".join(msg))
File "/usr/local/lib/python2.7/dist-packages/ptl/lib/pbs_testlib.py", line 8296, in expect
extend, level=level, msg=" ".join(msg))
File "/usr/local/lib/python2.7/dist-packages/ptl/lib/pbs_testlib.py", line 8296, in expect
extend, level=level, msg=" ".join(msg))
File "/usr/local/lib/python2.7/dist-packages/ptl/lib/pbs_testlib.py", line 8296, in expect
extend, level=level, msg=" ".join(msg))
File "/usr/local/lib/python2.7/dist-packages/ptl/lib/pbs_testlib.py", line 8296, in expect
extend, level=level, msg=" ".join(msg))
File "/usr/local/lib/python2.7/dist-packages/ptl/lib/pbs_testlib.py", line 8296, in expect
extend, level=level, msg=" ".join(msg))
File "/usr/local/lib/python2.7/dist-packages/ptl/lib/pbs_testlib.py", line 8296, in expect
extend, level=level, msg=" ".join(msg))
File "/usr/local/lib/python2.7/dist-packages/ptl/lib/pbs_testlib.py", line 8296, in expect
extend, level=level, msg=" ".join(msg))
File "/usr/local/lib/python2.7/dist-packages/ptl/lib/pbs_testlib.py", line 8296, in expect
extend, level=level, msg=" ".join(msg))
File "/usr/local/lib/python2.7/dist-packages/ptl/lib/pbs_testlib.py", line 8296, in expect
extend, level=level, msg=" ".join(msg))
File "/usr/local/lib/python2.7/dist-packages/ptl/lib/pbs_testlib.py", line 8296, in expect
extend, level=level, msg=" ".join(msg))
File "/usr/local/lib/python2.7/dist-packages/ptl/lib/pbs_testlib.py", line 8296, in expect
extend, level=level, msg=" ".join(msg))
File "/usr/local/lib/python2.7/dist-packages/ptl/lib/pbs_testlib.py", line 8296, in expect
extend, level=level, msg=" ".join(msg))
File "/usr/local/lib/python2.7/dist-packages/ptl/lib/pbs_testlib.py", line 8296, in expect
extend, level=level, msg=" ".join(msg))
File "/usr/local/lib/python2.7/dist-packages/ptl/lib/pbs_testlib.py", line 8296, in expect
extend, level=level, msg=" ".join(msg))
File "/usr/local/lib/python2.7/dist-packages/ptl/lib/pbs_testlib.py", line 8296, in expect
extend, level=level, msg=" ".join(msg))
File "/usr/local/lib/python2.7/dist-packages/ptl/lib/pbs_testlib.py", line 8296, in expect
extend, level=level, msg=" ".join(msg))
File "/usr/local/lib/python2.7/dist-packages/ptl/lib/pbs_testlib.py", line 8296, in expect
extend, level=level, msg=" ".join(msg))
File "/usr/local/lib/python2.7/dist-packages/ptl/lib/pbs_testlib.py", line 8296, in expect
extend, level=level, msg=" ".join(msg))
File "/usr/local/lib/python2.7/dist-packages/ptl/lib/pbs_testlib.py", line 8296, in expect
extend, level=level, msg=" ".join(msg))
File "/usr/local/lib/python2.7/dist-packages/ptl/lib/pbs_testlib.py", line 8296, in expect
extend, level=level, msg=" ".join(msg))
File "/usr/local/lib/python2.7/dist-packages/ptl/lib/pbs_testlib.py", line 8296, in expect
extend, level=level, msg=" ".join(msg))
File "/usr/local/lib/python2.7/dist-packages/ptl/lib/pbs_testlib.py", line 8296, in expect
extend, level=level, msg=" ".join(msg))
File "/usr/local/lib/python2.7/dist-packages/ptl/lib/pbs_testlib.py", line 8296, in expect
extend, level=level, msg=" ".join(msg))
File "/usr/local/lib/python2.7/dist-packages/ptl/lib/pbs_testlib.py", line 8296, in expect
extend, level=level, msg=" ".join(msg))
File "/usr/local/lib/python2.7/dist-packages/ptl/lib/pbs_testlib.py", line 8296, in expect
extend, level=level, msg=" ".join(msg))
File "/usr/local/lib/python2.7/dist-packages/ptl/lib/pbs_testlib.py", line 8296, in expect
extend, level=level, msg=" ".join(msg))
File "/usr/local/lib/python2.7/dist-packages/ptl/lib/pbs_testlib.py", line 8296, in expect
extend, level=level, msg=" ".join(msg))
File "/usr/local/lib/python2.7/dist-packages/ptl/lib/pbs_testlib.py", line 8296, in expect
extend, level=level, msg=" ".join(msg))
File "/usr/local/lib/python2.7/dist-packages/ptl/lib/pbs_testlib.py", line 8296, in expect
extend, level=level, msg=" ".join(msg))
File "/usr/local/lib/python2.7/dist-packages/ptl/lib/pbs_testlib.py", line 8296, in expect
extend, level=level, msg=" ".join(msg))
File "/usr/local/lib/python2.7/dist-packages/ptl/lib/pbs_testlib.py", line 8296, in expect
extend, level=level, msg=" ".join(msg))
File "/usr/local/lib/python2.7/dist-packages/ptl/lib/pbs_testlib.py", line 8296, in expect
extend, level=level, msg=" ".join(msg))
File "/usr/local/lib/python2.7/dist-packages/ptl/lib/pbs_testlib.py", line 8296, in expect
extend, level=level, msg=" ".join(msg))
File "/usr/local/lib/python2.7/dist-packages/ptl/lib/pbs_testlib.py", line 8296, in expect
extend, level=level, msg=" ".join(msg))
File "/usr/local/lib/python2.7/dist-packages/ptl/lib/pbs_testlib.py", line 8296, in expect
extend, level=level, msg=" ".join(msg))
File "/usr/local/lib/python2.7/dist-packages/ptl/lib/pbs_testlib.py", line 8296, in expect
extend, level=level, msg=" ".join(msg))
File "/usr/local/lib/python2.7/dist-packages/ptl/lib/pbs_testlib.py", line 8296, in expect
extend, level=level, msg=" ".join(msg))
File "/usr/local/lib/python2.7/dist-packages/ptl/lib/pbs_testlib.py", line 8296, in expect
extend, level=level, msg=" ".join(msg))
File "/usr/local/lib/python2.7/dist-packages/ptl/lib/pbs_testlib.py", line 8296, in expect
extend, level=level, msg=" ".join(msg))
File "/usr/local/lib/python2.7/dist-packages/ptl/lib/pbs_testlib.py", line 8296, in expect
extend, level=level, msg=" ".join(msg))
File "/usr/local/lib/python2.7/dist-packages/ptl/lib/pbs_testlib.py", line 8296, in expect
extend, level=level, msg=" ".join(msg))
File "/usr/local/lib/python2.7/dist-packages/ptl/lib/pbs_testlib.py", line 8296, in expect
extend, level=level, msg=" ".join(msg))
File "/usr/local/lib/python2.7/dist-packages/ptl/lib/pbs_testlib.py", line 8296, in expect
extend, level=level, msg=" ".join(msg))
File "/usr/local/lib/python2.7/dist-packages/ptl/lib/pbs_testlib.py", line 8296, in expect
extend, level=level, msg=" ".join(msg))
File "/usr/local/lib/python2.7/dist-packages/ptl/lib/pbs_testlib.py", line 8296, in expect
extend, level=level, msg=" ".join(msg))
File "/usr/local/lib/python2.7/dist-packages/ptl/lib/pbs_testlib.py", line 8296, in expect
extend, level=level, msg=" ".join(msg))
File "/usr/local/lib/python2.7/dist-packages/ptl/lib/pbs_testlib.py", line 8296, in expect
extend, level=level, msg=" ".join(msg))
File "/usr/local/lib/python2.7/dist-packages/ptl/lib/pbs_testlib.py", line 8296, in expect
extend, level=level, msg=" ".join(msg))
File "/usr/local/lib/python2.7/dist-packages/ptl/lib/pbs_testlib.py", line 8296, in expect
extend, level=level, msg=" ".join(msg))
File "/usr/local/lib/python2.7/dist-packages/ptl/lib/pbs_testlib.py", line 8296, in expect
extend, level=level, msg=" ".join(msg))
File "/usr/local/lib/python2.7/dist-packages/ptl/lib/pbs_testlib.py", line 8296, in expect
extend, level=level, msg=" ".join(msg))
File "/usr/local/lib/python2.7/dist-packages/ptl/lib/pbs_testlib.py", line 8105, in expect
raise PtlExpectError(rc=1, rv=False, msg=_msg)
PtlExpectError: rc=1, rv=False, msg=expected on server testdev: server_state != Scheduling server testdev.pbspro.org attempt: 60 got: server_state = Scheduling

2018-12-07 09:18:41,943 INFO ================================================================================
failed: test_fairshare (tests.pbs_smoketest.SmokeTest)
skipped: test_cray_compute_job (tests.functional.pbs_cray_smoketest.TestCraySmokeTest) reason: Test suite only meant to run on a Cray
skipped: test_cray_login_job (tests.functional.pbs_cray_smoketest.TestCraySmokeTest) reason: Test suite only meant to run on a Cray
skipped: test_default_restrict_res_to_release_on_suspend_setting (tests.functional.pbs_cray_suspend_resume.TestSuspendResumeOnCray) reason: Test suite only meant to run on a Cray
skipped: test_settings (tests.functional.pbs_cray_vnode_per_numa.TestVnodePerNumaNode) reason: Test suite only meant to run on a Cray
Test cases with failures: SmokeTest.test_fairshare
Test suites with failures: SmokeTest
run: 57, succeeded: 52, failed: 1, errors: 0, skipped: 4, timedout: 0
Tests run in 0:08:26.529429
2018-12-07 09:18:41,943 INFO Cleaning up temporary files
2018-12-07 09:18:41,944 INFO Cleaning up /var/tmp dir
2018-12-07 09:18:41,944 INFO Cleaning up /tmp dir
travis_time:end:277442eb:start=1544173814226617642,finish=1544174322052107216,duration=507825489574
[0K[31;1mThe command "docker exec -it -w $(pwd)/test/tests testdev pbs_benchpress --tags=smoke" failed and exited with 1 during .[0m

Your build has been stopped.

Acceptance Criteria

None

Status

Assignee

Unassigned

Reporter

sarita kh

Severity

None

OS

None

Start Date

None

Pull Request URL

None

Story Points

1

Priority

Low
Configure