test failures in TestAdminSuspend

Description

Need to analyze and fixed following failures

2017-12-04 22:34:02,022 INFO ERROR: test_basic_restart (tests.functional.pbs_admin_suspend.TestAdminSuspend)

2017-12-04 22:34:02,022 INFO __m_oo_m__
2017-12-04 22:34:02,022 INFO Traceback (most recent call last):
File "/home/pbsroot/TEST/tmp/tests/functional/pbs_admin_suspend.py", line 155, in test_basic_restart
self.server.sigjob(jid, 'admin-resume', runas=ROOT_USER)
File "/home/pbsroot/TEST/tmp/18.2.0.20171012010530/lib/python2.7/site-packages/ptl/lib/pbs_testlib.py", line 6521, in sigjob
post=self._disconnect, conn=c)
PbsSignalError: rc=250, rv=False, msg=['qsig: Floating License unavailable 0.x36-64-rhel6']

2017-12-04 22:34:02,022 INFO ======================================================================
2017-12-04 22:34:02,022 INFO ERROR: test_cmd_perm (tests.functional.pbs_admin_suspend.TestAdminSuspend)

2017-12-04 22:34:02,022 INFO __m_oo_m__
2017-12-04 22:34:02,022 INFO Traceback (most recent call last):
File "/home/pbsroot/TEST/tmp/tests/functional/pbs_admin_suspend.py", line 183, in test_cmd_perm
in e.msg[0])
IndexError: list index out of range

2017-12-04 22:34:02,022 INFO ======================================================================
2017-12-04 22:34:02,022 INFO ERROR: test_list_jobs_1 (tests.functional.pbs_admin_suspend.TestAdminSuspend)

2017-12-04 22:34:02,022 INFO __m_oo_m__
2017-12-04 22:34:02,023 INFO Traceback (most recent call last):
File "/home/pbsroot/TEST/tmp/tests/functional/pbs_admin_suspend.py", line 704, in test_list_jobs_1
self.assertTrue(msg in e.msg[0])
IndexError: list index out of range

2017-12-04 22:34:02,023 INFO ================================================================================
error: test_basic_restart (tests.functional.pbs_admin_suspend.TestAdminSuspend)
error: test_cmd_perm (tests.functional.pbs_admin_suspend.TestAdminSuspend)
error: test_list_jobs_1 (tests.functional.pbs_admin_suspend.TestAdminSuspend)
Test cases with failures: TestAdminSuspend.test_basic_restart,TestAdminSuspend.test_cmd_perm,TestAdminSuspend.test_list_jobs_1
Test suites with failures: TestAdminSuspend
run: 4, succeeded: 1, failed: 0, errors: 3, skipped: 0, timedout: 0
Tests run in 0:01:15.858933

Acceptance Criteria

None

Status

Assignee

Unassigned

Reporter

anamika upadhyay

Severity

3-High

OS

None

Start Date

None

Pull Request URL

None

Story Points

1

Components

Priority

High
Configure